viscosity measure
type: ObjectProperty
comment: added from BSP (per-class property assessment)
domain includes: DangerousGoods
range includes: Measure
definition: A viscosity measure for these transported dangerous goods.
term status: proposed